تجهیزات زیست‌پزشکی
preferred label: biomedical equipment @en
type: Concept
narrower: حسگر زیست‌پزشکی

حسگر زیست‌پزشکی
scope note: حسگری که برای پایش‌های تهاجمی یا غیرتهاجمی متغیرهای کاراندام‌شناختی کلیدی به‌منظور تشخیص طبی و نظارت بر درمان به کار می‌رود.
broader: تجهیزات زیست‌پزشکی
preferred label: biomedical sensor @en
type: Concept