تاریخ
preferred label: history @en
type: Concept
related: سرگذشت

سرگذشت
alternative label: فرهنگ زندگی‌نامه‌ای
scope note: کتابی که در آن زندگی‌نامۀ شخصیتی شرح داده شده باشد
related: تاریخ
preferred label: biography @en
type: Concept