نقاله بادی
scope note: نقاله‌ای که در آن برای انتقال دانه‌ها از جریان هوا استفاده می‌شود.
broader: نقاله
preferred label: pneumatic conveyor @en
type: Concept

نقاله
preferred label: conveyor @en
type: Concept
narrower: نقاله بادی