جرثقیل شناور
scope note: جرثقیل نصب‌شده بر روی شناور برای جابه‌جا کردن بارهای سنگین در دریا
broader: جرثقیل
preferred label: floating crane @en
type: Concept

جرثقیل
preferred label: crane @en
type: Concept
narrower: جرثقیل شناور