جرثقیل دروازه‌ای
preferred label: gantry crane @en
type: Concept
narrower: جرثقیل بارگنج‌بر

جرثقیل بارگنج‌بر
scope note: نوعی جرثقیل دروازه‌ای که از آن برای تخلیه و بارگیری بارگُنج‌ها یا نقل‌و‌انتقال آنها در بندر یا پایانه استفاده می‌شود.
broader: جرثقیل دروازه‌ای
preferred label: transtainer @en
type: Concept