جرثقیل
preferred label: crane @en
type: Concept
narrower: جرثقیل ریلی

جرثقیل ریلی
scope note: نوعی جرثقیل با دیرک بلند که برای جابه‌جایی بارهای سنگین به کار می‌رود و بر روی ریل حرکت می‌کند.
broader: جرثقیل
preferred label: locomotive crane @en
type: Concept