جرثقیل
preferred label: crane @en
type: Concept
narrower: جرثقیل داربری

جرثقیل داربری
scope note: تجهیزات داربَری که با آن میتوان بینه‌ها را به‌ طرف سیم‌نقاله برد و نیز آنها را سوار سیم‌نقاله کرد یا در بارانداز پایین آورد.
broader: جرثقیل
preferred label: skyline crane @en
type: Concept