بالابر
preferred label: lift @en
type: Concept
narrower: بالابر جمع‌شو

بالابر جمع‌شو
scope note: سکویی نصب‌شده بر روی دو جفت بازوی به‌هم‌محورشده که جابه‌جایی عمودی را ممکن می‌کند.
broader: بالابر
preferred label: scissor lift @en
type: Concept