خشک‌افشانی
scope note: فرایندی که در آن ذرات افشانده‌شده، پیش از رسیدن به سطح، تا حدودی خشک می‌شوند و درنتیجه پوششی شنی ایجاد می‌شود.
broader: افشانش
preferred label: dry spray @en
type: Concept

افشانش
preferred label: spraying @en
type: Concept
narrower: خشک‌افشانی