انبارش
preferred label: storage @en
type: Concept
related: روی‌هم‌چینی

جابه‌جایی مواد
preferred label: materials handling @en
type: Concept
narrower: روی‌هم‌چینی

روی‌هم‌چینی
scope note: روی هم قرار دادن جعبه‌ها و بارگُنج‌ها و بارکف‌های هم‌شکل با نظم‌ و ترتیب خاص و حفظ ایمنی
related: انبارش
broader: جابه‌جایی مواد
preferred label: stacking @en
type: Concept