فهرست نجومی
preferred label: astronomical catalogue @en
type: Concept
narrower: فهرست منطقـه‌البروجی

فهرست منطقـه‌البروجی
scope note: فهرستی شامل موقعیت و قدر و ردۀ طیفی و حرکت خاصۀ (proper motion) 3539 ستاره که حداکثر حدود 8 درجه از دایره‌البروج فاصله دارند.
broader: فهرست نجومی
preferred label: Zodiacal Catalogue @en
type: Concept