astroarchaeology
alternative label: archaeoastronomy
scope note: بررسی اخترشناسی قدیم با استفاده از بقایای باستان‌شناختی و همچنین بررسی باستان‌شناسی مواد برجای‌مانده از فعالیت‌های اخترشناسی یا تاریخ‌اخترشناسی @fa
related: archaeology
related: astronomy
preferred label: باستان‌اخترشناسی @fa
type: Concept

astronomy
preferred label: اخترشناسی @fa
type: Concept
related: astroarchaeology

archaeology
preferred label: باستان‌شناسی @fa
type: Concept
related: astroarchaeology