آرایه
preferred label: array @en
type: Concept
narrower: آرایه قطبی-دوقطبی

آرایه قطبی-دوقطبی
scope note: آرایه‌ای که در آن جفت‌الکترودهای پتانسیل پی‌درپی دورتر از یکی از الکترودهای جریان بر روی خط برداشت (survey line) قرار می‌گیرند.
broader: آرایه
preferred label: pole-dipole array @en
type: Concept