آرایه
preferred label: array @en
type: Concept
narrower: آرایه شلومبرگر

آرایه شلومبرگر
alternative label: آرایه الکترود شلومبرگر
scope note: آرایه‌ای که در آن زوج‌الکترودهای داخلی برای اندازه‌گیری ولتاژ، در مقایسه با زوج‌الکترودهای خارجی جریان، خیلی به هم نزدیک‌اند.
broader: آرایه
preferred label: Schlumberger array @en
type: Concept