معماری
preferred label: architecture @en
type: Concept
narrower: معماری منظر

معماری منظر
scope note: برنامه‌ریزی و طراحی فضای باز برای بهره‌مندی انسان
broader: معماری
preferred label: landscape architecture @en
type: Concept