باستان‌شناسی نجات
scope note: شاخه‌ای از باستان‌شناسی که به مطالعۀ اشیا و سازه‌های موجود در محوطه‌هایی می‌پردازد که در نتیجۀ عملیات عمرانی، مانند ساختن سدها و بناها و شاهراه‌ها، در معرض نابودی است.
broader: باستان‌شناسی
preferred label: rescue archaeology @en
type: Concept

باستان‌شناسی
preferred label: archaeology @en
type: Concept
narrower: باستان‌شناسی نجات