فولاد میان‌کربن
scope note: فولادی که میزان کربن آن بین 0/15 تا 0/3 درصد است.
broader: فولاد کربنی
preferred label: medium carbon steel @en
type: Concept

فولاد کربنی
preferred label: carbon steel @en
type: Concept
narrower: فولاد میان‌کربن