حساس‌شدگی فولاد زنگ‌نزن
scope note: کاهش کروم در منطقۀ مجاور با مرز دانه‌های فولاد آستینتی براثر رسوب کروم‌کاربید در دمای 500 تا 880 درجۀ سلسیوس
broader: فولاد زنگ‌نزن
preferred label: stainless steel sensitization @en
type: Concept

فولاد زنگ‌نزن
preferred label: stainless steel @en
type: Concept
narrower: حساس‌شدگی فولاد زنگ‌نزن