سپیدایی
preferred label: albedo @en
type: Concept
narrower: ذرات سپیدایی

ذرات سپیدایی
scope note: نوترون‌ها یا ذرات بنیادی دیگر که پس از تولید ازطریق برهم‌کنش‌های هسته‌ای ذرات پرانرژی در درون جوّ زمین، آن را ترک می‌کنند.
broader: سپیدایی
preferred label: albedo particles @en
type: Concept