انعقاد
scope note: ناپایدار شدن و مجتمع شدن اولیۀ ذرات معلق ریز و کلوئیدی موجود در آب با افزودن مواد شیمیایی مناسب
related: کلوئید
broader: انبوهش
preferred label: coagulation @en
type: Concept

انبوهش
preferred label: aggregation @en
type: Concept
narrower: انعقاد

کلوئید
preferred label: colloid @en
type: Concept
related: انعقاد