پیرش
preferred label: ageing @en
type: Concept
narrower: پیرسازی

پیرسازی
alternative label: پیرش مصنوعی
scope note: عملیات حرارتی آلیاژ در دمای نسبتاً بالا برای سرعت‌ دادن به رسوب یک فاز یا یک جزء از محلول جامد اَبَر‌اشباع
broader: پیرش
preferred label: artificial ageing @en
type: Concept