ابیراهی
preferred label: aberration @en
type: Concept
narrower: ابیراهی نور ستاره

ابیراهی نور ستاره
scope note: تفاوت ظاهری و کوچک راستای رصدشدۀ ستاره با راستای واقعی آن، در نتیجۀ حرکت رصدکننده یا ناظر در جهت عمود بر مسیر نور دریافتی از ستاره و محدود بودن سرعت نور
broader: ابیراهی
preferred label: aberration of star light @en
type: Concept