تغلیظ سوگند
type: Concept
broader: سوگند
scope note: تغلیظ، یعنی «غلیظ کردن»، «تشدید کردن» و «تغلیظ قسم یا سوگند» آن است که دادرس با توجه به وضعیت ادعا یا دعوا، سوگند ساده و متعارف را نپذیرد و کیفیت تغلیظ را از حیث «زمان»، «مکان» و «الفاظ» سوگند منوط به انجام تشریفات خاص کند.

سوگند
type: Concept
narrower: تغلیظ سوگند