دعوای متقابل
type: Concept
broader: امور اتفاقی
scope note: ماده 141 قانون آیین دادرسی مدنی. خوانده می¬تواند در مقابل ادعای خواهان، اقامه دعوا نماید. چنین دعوایی در صورتی که با دعوای اصلی ناشی از یک منشأ بوده یا ارتباط کامل داشته باشد، «دعوای متقابل» نامیده شده و توأماً رسیدگی می¬شود و چنانچه دعوای متقابل نباشد در دادگاه صالح به طور جداگانه رسیدگی خواهد شد. بین دو دعوا وقتی ارتباط کامل موجود است که اتخاذ تصمیم در هریک، مؤثر در دیگری باشد.

امور اتفاقی
type: Concept
narrower: دعوای متقابل