نزدیک‌ترین دادگاه عم‌عرض
type: Concept
broader: دادگاه همعرض

دادگاه همعرض
type: Concept
alternative label: شعبه همعرض
broader: دادگاه
narrower: نزدیک‌ترین دادگاه عم‌عرض
scope note: داداگاه هم‌عرض، دادگاهی است که با دادگاه رسیدگی‌کننده از نظر صنف و نوع و درجه، هم‌سان باشد.

دادگاه
type: Concept
narrower: دادگاه همعرض