ابلاغ
type: Concept
narrower: ابلاغ به محجور

ابلاغ به محجور
scope note: «محجور»، یعنی کسی که دارای اهلیت نیست و سه گروه را شامل می¬شود: «کسی که دارای عقل نیست (مجنون یا دیوانه)، کسی که به سن کِبَر نرسیده است (صغیر) و کسی که دارای رشد نباشد (غیررشید یا سفیه).
broader: ابلاغ
type: Concept