دعوای اصلی
scope note: «دعوای اصلی»، یعنی دعوایی که اولاً توسط خواهان اقامه شده است و هر دعوایی که در جریان دعوای اصلی و در اثنای آن، از سوی خواهان یا خوانده اقامه می‌شود، «دعوای طاری» نامیده می‌شود.
narrower: طرفین دعوای اصلی
broader: دعوا
type: Concept

طرفین دعوای اصلی
type: Concept
broader: دعوای اصلی

دعوا
type: Concept
narrower: دعوای اصلی