سند رسمی
scope note: ماده 1287 قانون مدنی: اسنادی که در اداره ثبت اسناد و املاک ویا دفاتر اسناد رسمی یا در نزد سایر مأمورین رسمی، در حدود صلاحیت آن‌‌ها، و برطبق مقررات قانونی تنظیم شده باشند، رسمی است. ماده 1289 قانون مدنی: غیر از اسناد مذکوره در ماده 1287، سایر اسناد، عادی است.
broader: سند
type: Concept

سند
type: Concept
narrower: سند رسمی