اقرار شفاهی
scope note: ماده 204 قانون آیین دادرسی مدنی. اقرار، شفاهی است وقتی که حین مذاکره در دادگاه به عمل آید و کتبی است در صورتی که در یکی از اسناد یا لوایحی که به دادگاه تقدیم گردیده اظهار شده باشد. در اقرار شفاهی، طرفی که می¬خواهد از اقرار طرف دیگر استفاده نماید باید از دادگاه بخواهد که اقرار او در صورتمجلس قید شود.
narrower: ثبت اقرار شفاهی
broader: اقرار
type: Concept

ثبت اقرار شفاهی
type: Concept
broader: اقرار شفاهی

اقرار
type: Concept
narrower: اقرار شفاهی