موعد قانونی
scope note: موعد قانونی، عبارت است از هر مدت زمانی که طبق قانون برای انجام یک امر مقرر شده است.
narrower: عدم استفاده از موعد قانونی
broader: موعد
type: Concept

عدم استفاده از موعد قانونی
type: Concept
broader: موعد قانونی

موعد
type: Concept
narrower: موعد قانونی