حکم حضوری
scope note: ماده 303 قانون آیین دادرسی مدنی. حکم دادگاه، حضوری است، مگر این¬که خوانده یا وکیل یا قائم¬مقام یا نماینده قانونی وی در هیچ‌یک از جلسات دادگاه حاضر نشده و به طور کتبی نیز دفاع ننموده باشد ویا اخطاریه ابلاغ واقعی نشده باشد.
broader: حکم
type: Concept

حکم
type: Concept
narrower: حکم حضوری