رأی داور
type: Concept
narrower: بطلان رأی داور

بطلان رأی داور
scope note: ماده 489 قانون آیین دادرسی مدنی. رأی داوری در موارد زیر باطل است و قابلیت اجرایی ندارد: 1. رأی صادره مخالف با قوانین موجد حق باشد، 2. داور نسبت به مطلبی که موضوع داوری نبوده رأی صادر کرده است، 3. داور خارج از حدود اختیارات خود رأی صادر نموده باشد. در این صورت، فقط آن قسمت از رأی که خارج از اختیارات داور است ابطال می¬گردد، 4. رأی داور پس از انقضایِ مدت داوری صادر و تسلیم شده باشد، 5. رأی داور با آنچه در دفتر املاک یا بین اصحاب دعوا در دفتر اسناد رسمی ثبت شده و دارای اعتبار قانونی است مخالف باشد، 6. رأی به وسیله داورانی صادر شده که مجاز به صدور رأی نبوده¬اند، 7. قرارداد رجوع به داوری بی¬اعتبار بوده باشد.
broader: رأی داور
type: Concept