سرداور
alternative label: داور سوم
scope note: ماده 464 قانون آیین دادرسی مدنی. در صورتی که در قرارداد داوری، تعداد داور معین نشده باشد و طرفین نتوانند در تعیین داور یا داوران توافق کنند، هریک از طرفین باید یک نفر داور اختصاصی معرفی و یک نفر به¬عنوان داور سوم به اتفاق تعیین نمایند.
broader: داور
type: Concept

داور
type: Concept
narrower: سرداور