نقض رأی
type: Concept
narrower: نقض بلاارجاع

نقض بلاارجاع
scope note: نقض بلاارجاع، یعنی این‌که رأی مورد اعتراض، پس از نقض، مطابق ماده 402 به همان دادگاه صادرکنندۀ رأی نقض شده ویا شعبه هم‌عرض ارجاع نمی‌شود.
broader: نقض رأی
type: Concept