جهات جرح
type: Concept
broader: جرح شاهد

شاهد
type: Concept
narrower: جرح شاهد

جرح شاهد
scope note: ماده 191 قانون مجازات اسلامی (کتاب اول، مصوب 1/2/1392): شاهد شرعی قابل جَرح و تعدیل است. جَرح شاهد عبارت از شهادت بر فقدان یکی از شرایطی که قانون برای شاهد شرعی مقرر کرده است و تعدیل شاهد عبارت از شهادت بر وجود شرایط مذکور برای شاهد شرعی است.
narrower: جهات جرح
broader: شاهد
type: Concept