رد دادرس
scope note: درباره موارد معذور بودن دادرس از رسیدگی، ماده 91 قانون آیین دادرسی مدنی: دادرس در موارد زیر باید از رسیدگی امتناع نموده و طرفین دعوا نیز می¬توانند او را رد کنند: الف) قرابت نسبی یا سببی تا درجه سوم از هر طبقه بین دادرس با یکی از اصحاب دعوا وجود داشته باشد. ب) دادرس قیم یا مخدوم یکی از طرفین باشد ویا یکی از طرفین، مباشر یا متکفل امور دادرس یا همسر او باشد. ج) دادرس یا همسر یا فرزند او، وارث یکی از اصحاب دعوا باشد. د) دادرس سابقاً در موضوع دعوای اقامه شده به¬عنوان دادرس یا داور یا کارشناس یا گواه اظهارنظر کرده باشد. ه‍¬) بین دادرس و یکی از طرفین ویا همسر یا فرزند او دعوای حقوقی یا جزایی مطرح باشد ویا در سابق مطرح بوده و از تاریخ صدور حکم قطعی دو سال نگذشته باشد. و) دادرس یا همسر یا فرزند او دارای نفع شخصی در موضوع مطروح باشند.
narrower: موارد رد دادرس
broader: قاضی
type: Concept

موارد رد دادرس
type: Concept
broader: رد دادرس

قاضی
type: Concept
narrower: رد دادرس