قائم‌مقام
scope note: «قائم¬مقام» عبارت است از «کسی که به جانشینی از دیگری، حقوق و تکالیفی پیدا می¬کند؛ خواه برای اجرای هدف او کار کند، مانند نماینده تجارتی (ماده 395 تا 401 قانون تجارت) یا برای اجرای هدف خود، مانند وارث نسبت به ترکه یا خریدار نسبت به مبیع پس از بیع» (جعفری لنگرودی، ترمینولوژی حقوق).
narrower: قائم مقام قانونی
type: Concept

قائم مقام قانونی
type: Concept
broader: قائم‌مقام