مال
type: Concept
narrower: مال غیرمنقول

مال غیرمنقول
scope note: ماده 12 قانون مدنی: مال غیرمنقول آن است که از م‍حلی به م‍حل دیگر نتوان نقل نمود، اعم از این که استقرار آن ذاتی باشد یا به واسطه عمل انسان؛ به نحوی که نقل آن، مستلزم خرابی یا نقص خود مال یا م‍حل آن شود.
broader: مال
type: Concept