دادگاه صالح
scope note: «دادگاه صالح»، یعنی هر دادگاهی که براساس مواد فصل اول و دوم از باب اول قانون آیین دادرسی مدنی (ماده 10 تا 29) صلاحیت رسیدگی به دعوا داشته باشد.
broader: دادگاه
type: Concept

دادگاه
type: Concept
narrower: دادگاه صالح