همسان‌درمانی
type: Concept
alternative label: هومئوپاتی
broader: دارودرمانی
preferred label: homeopathy @en
scope note: نظامی درمانی مبتنی بر اصل "همانند، همانند را شفا می دهد".

دارودرمانی
type: Concept
narrower: همسان‌درمانی
preferred label: drug therapy @en