سازمان مشورتی دریانوردی بین‌الدولی (ایمکو)
type: Concept
alternative label: سازمان بین الدولی مشورتی دریانوردی ( ایمکو )
broader: آژانس‌های سازمان ملل متحد
preferred label: Intergovernmental Maritime Consultative Organization (IMCO) @en
scope note: سازمان بین الدولی مشورتی دریانوردی ( ایمکو )

آژانس‌های سازمان ملل متحد
type: Concept
narrower: سازمان مشورتی دریانوردی بین‌الدولی (ایمکو)
preferred label: UN agencies @en