واکنش‌های تبادلی
type: Concept
broader: واکنش‌های شیمیایی
preferred label: exchange reactions @en
related: واکنش‌های جانشینی
scope note: واکنشی که در آن دو اتم یا دو یون در دو مولکول مختلف یا در یک مولکول با یکدیگر جابه‌جا شوند.

واکنش‌های جانشینی
type: Concept
preferred label: substitution reactions @en
related: واکنش‌های تبادلی

واکنش‌های شیمیایی
type: Concept
narrower: واکنش‌های تبادلی
preferred label: chemical reactions @en