hydrolysis
type: Concept
alternative label: SAPONIFICACION
broader: decomposition reactions
preferred label: آبکافت @fa
related: esterification
scope note: گسسته شدن یک مولکول در واکنش با آب به طوری که بخشی از مولکول به هیدروکسیل آب و بخشی دیگر آن به یون هیدروژن بپیوندد. @fa

decomposition reactions
type: Concept
narrower: hydrolysis
preferred label: واکنش‌های تجزیه @fa

esterification
type: Concept
preferred label: استری کردن ( شدن) @fa
related: hydrolysis