زحل
type: Concept
alternative label: کیوان (سیاره)
broader: سیاره‌ها
preferred label: saturn @en
scope note: ششمین سیارۀ منظومۀ شمسی از لحاظ فاصله از خورشید که سیاره‌ای گازی با قطری برابر زمین است و شامل حلقۀ زیبایی از ذرات غبار و تکه های یخ و سنگ است.

سیاره‌ها
type: Concept
narrower: زحل
preferred label: planets @en