meteorites
type: Concept
alternative label: CONDRITOS
broader: celestial bodies
preferred label: شهاب‌سنگ‌ها @fa
related: meteoroids
scope note: تکه‌سنگ‌ باقیمانده از شهاب‌واره‌ که پس از سوختن در جوّ به زمین رسیده باشند. @fa

meteoroids
type: Concept
preferred label: شهاب‌واره‌ها @fa
related: meteorites

celestial bodies
type: Concept
narrower: meteorites
preferred label: اجرام آسمانی @fa