پیام‌نما
type: Concept
broader: سیستم‌های تلویزیون
preferred label: teletext @en
scope note: سیستمی که اطلاعات مورد نیاز روزانه را از قبیل اجناس و ساعت پرواز هواپیما و اخبار مهم سیاسی و اجتماعی، به صورت نوشته، روی صفحۀ تلویزیون ظاهر کند.

سیستم‌های تلویزیون
type: Concept
narrower: پیام‌نما
preferred label: television systems @en