آر.ان.آ
type: Concept
alternative label: ریبونوکلئیک اسید
broader: نوکلئیک اسیدها
preferred label: RNA @en
scope note: بسپاری متشکل از واحدهای ریبونوکلئوتید. "رنا" پیشنهاد فرهنگستان زبان و ادب فارسی است.

نوکلئیک اسیدها
type: Concept
narrower: آر.ان.آ
preferred label: nucleic acids @en