پولینزی فرانسه
type: Concept
broader: جزایر فرانسه در اقیانوس آرام
preferred label: French Polynesia @en
scope note: قلمرو ماورای بحار فرانسه در منطقۀ پلینزی اقیانوسیه، شامل پنج جزیرگان پراکنده در جنوب خاوری اقیانوس آرام، میان جزایر کوک (باختر) و جزایر پیتکرن (خاور).

جزایر فرانسه در اقیانوس آرام
type: Concept
narrower: پولینزی فرانسه
preferred label: Pacific islands FR @en