جوش‌کاری
type: Concept
preferred label: welding @en
related: لحیم‌کاری

لحیم‌کاری
type: Concept
broader: فناوری فلزکاری
preferred label: brazing @en
related: جوش‌کاری
scope note: فرایند اتصال دو قطعه به یکدیگر از طریق ذوب و انجماد یک آلیاژ زودذوب.

فناوری فلزکاری
type: Concept
narrower: لحیم‌کاری
preferred label: metalworking technology @en