آنتیگوا و باربودا
type: Concept
broader: کشورهای متحده هند غربی (کارائیب)
preferred label: Antigua & Barbuda @en
scope note: کشوری شامل سه جزیره از جزیرگان هند غربی، در جزایر لیوارد از گروه آنتیل کوچک.

کشورهای متحده هند غربی (کارائیب)
type: Concept
narrower: آنتیگوا و باربودا
preferred label: West Indies Associated States @en